Beim installieren bekomme ich folgendes im Log:
nvidia-installer log file '/var/log/nvidia-installer.log'
creation time: Sun May 22 10:15:39 2005
option status:
license pre-accepted : false
update : false
force update : false
expert : false
uninstall : false
driver info : false
no precompiled interface: false
no ncurses color : false
query latest driver ver : false
OpenGL header files : false
no questions : false
silent : false
no backup : false
kernel module only : false
sanity : false
add this kernel : false
no runlevel check : false
no network : false
no ABI note : false
no RPMs : false
force tls : (not specified)
force compat32 tls : (not specified)
X install prefix : /usr/X11R6
OpenGL install prefix : /usr
compat32 install prefix : (not specified)
installer install prefix: /usr
utility install prefix : /usr
kernel name : (not specified)
kernel include path : (not specified)
kernel source path : /usr/src/linux-2.6.8-24
kernel output path : (not specified)
kernel install path : (not specified)
proc mount point : /proc
ui : (not specified)
tmpdir : /tmp
ftp mirror : ftp://download.nvidia.com
RPM file list : (not specified)
Using: nvidia-installer ncurses user interface
-> License accepted.
-> There appears to already be a driver installed on your system (version: 1.0-
6111). As part of installing this driver (version: 1.0-6629), the existing
driver will be uninstalled. Are you sure you want to continue? ('no' will a
bort installation) (Answer: Yes)
-> No precompiled kernel interface was found to match your kernel; would you li
ke the installer to attempt to download a kernel interface for your kernel f
rom the NVIDIA ftp site (ftp://download.nvidia.com)? (Answer: Yes)
-> No matching precompiled kernel interface was found on the NVIDIA ftp site;
this means that the installer will need to compile a kernel interface for
your kernel.
-> Using the kernel source path '/usr/src/linux-2.6.8-24' as specified by the
'--kernel-source-path' commandline option.
-> Kernel source path: '/usr/src/linux-2.6.8-24'
-> Performing CC test with CC="cc".
-> Performing rivafb check.
-> Performing rivafb module check.
WARNING: Your kernel was configured to include rivafb support as
a loadable kernel module.
The rivafb driver conflicts with the NVIDIA driver; the
NVIDIA kernel module will still be built and installed,
but be aware that the NVIDIA driver will not be able to
function properly if the rivafb module is loaded!
-> Cleaning kernel module build directory.
executing: 'cd ./usr/src/nv; make clean'...
rm -f -f nv.o nv-vm.o os-agp.o os-interface.o os-registry.o nv.o nv-vm.o os-
agp.o os-interface.o os-registry.o nvidia.mod.o
rm -f -f build-in.o nv-linux.o *.d .*.{cmd,flags}
rm -f -f nvidia.{o,ko,mod.{o,c}} nv_compiler.h *~
rm -f -rf .tmp_versions
-> Building kernel module:
executing: 'cd ./usr/src/nv; make module SYSSRC=/usr/src/linux-2.6.8-24 SYSO
UT=/usr/src/linux-2.6.8-24'...
Your kernel was configured to include rivafb support as
a loadable kernel module.
The rivafb driver conflicts with the NVIDIA driver; the
NVIDIA kernel module will still be built and installed,
but be aware that the NVIDIA driver will not be able to
function properly if the rivafb module is loaded!
*** Failed rivafb module sanity check, but continuing! ***
NVIDIA: calling KBUILD...
make CC=cc KBUILD_VERBOSE=1 -C /usr/src/linux-2.6.8-24 SUBDIRS=/tmp/selfgz2
765/NVIDIA-Linux-x86-1.0-6629-pkg1/usr/src/nv modules
Makefile:465: .config: No such file or directory
mkdir -p /tmp/selfgz2765/NVIDIA-Linux-x86-1.0-6629-pkg1/usr/src/nv/.tmp_vers
ions
WARNING: Symbol version dump /usr/src/linux-2.6.8-24/Module.symvers is miss
ing, modules will have CONFIG_MODVERSIONS disabled.
make -f scripts/Makefile.build obj=/tmp/selfgz2765/NVIDIA-Linux-x86-1.0-6629
-pkg1/usr/src/nv
echo \#define NV_COMPILER \"`cc -v 2>&1 | tail -n 1`\" > /tmp/selfgz2765/NVI
DIA-Linux-x86-1.0-6629-pkg1/usr/src/nv/nv_compiler.h
cc -Wp,-MD,/tmp/selfgz2765/NVIDIA-Linux-x86-1.0-6629-pkg1/usr/src/nv/.nv.o
.d -nostdinc -iwithprefix include -D__KERNEL__ -Iinclude -Wall -Wstrict-pro
totypes -Wno-trigraphs -fno-strict-aliasing -fno-common -O2 -fomit-frame-poi
nter -pipe -msoft-float -mpreferred-stack-boundary=2 -funit-at-a-time -fno-
unit-at-a-time -Iinclude/asm-i386/mach-default -I/tmp/selfgz2765/NVIDIA-Lin
ux-x86-1.0-6629-pkg1/usr/src/nv -Wall -Wimplicit -Wreturn-type -Wswitch -Wfo
rmat -Wchar-subscripts -Wparentheses -Wpointer-arith -Wno-multichar -Werro
r -O -fno-common -MD -Wno-cast-qual -Wno-error -D_LOOSE_KERNEL_NAMES -D__K
ERNEL__ -DMODULE -DNTRM -D_GNU_SOURCE -D_LOOSE_KERNEL_NAMES -D__KERNEL__ -D
MODULE -DNV_MAJOR_VERSION=1 -DNV_MINOR_VERSION=0 -DNV_PATCHLEVEL=6629 -DNV
_UNIX -DNV_LINUX -DNV_INT64_OK -DNVCPU_X86 -UDEBUG -U_DEBUG -DNDE
BUG -DNV_REMAP_PAGE_RANGE_5 -DNV_CHANGE_PAGE_ATTR_PRESENT -DNV_PCI_DISABLE_D
EVICE_PRESENT -DNV_CLASS_SIMPLE_CREATE_PRESENT -DMODULE -DKBUILD_BASENAME=n
v -DKBUILD_MODNAME=nvidia -c -o /tmp/selfgz2765/NVIDIA-Lin
ux-x86-1.0-6629-pkg1/usr/src/nv/nv.o /tmp/selfgz2765/NVIDIA-Linux-x86-1.0-66
29-pkg1/usr/src/nv/nv.c
In file included from include/linux/timex.h:61,
from include/linux/sched.h:11,
from include/linux/module.h:10,
from /tmp/selfgz2765/NVIDIA-Linux-x86-1.0-6629-pkg1/usr/src
/nv/nv-linux.h:52,
from /tmp/selfgz2765/NVIDIA-Linux-x86-1.0-6629-pkg1/usr/src
/nv/nv.c:14:
include/asm/io.h: In function `check_signature':
include/asm/io.h:238: warning: wrong type argument to increment
In file included from include/linux/list.h:7,
from include/linux/wait.h:23,
from include/asm/semaphore.h:41,
from include/linux/sched.h:18,
from include/linux/module.h:10,
from /tmp/selfgz2765/NVIDIA-Linux-x86-1.0-6629-pkg1/usr/src
/nv/nv-linux.h:52,
from /tmp/selfgz2765/NVIDIA-Linux-x86-1.0-6629-pkg1/usr/src
/nv/nv.c:14:
include/linux/prefetch.h: In function `prefetch_range':
include/linux/prefetch.h:62: warning: pointer of type `void *' used in arith
metic
/bin/sh: scripts/basic/fixdep: No such file or directory
make[3]: *** [/tmp/selfgz2765/NVIDIA-Linux-x86-1.0-6629-pkg1/usr/src/nv/nv.o
] Error 1
make[2]: *** [_module_/tmp/selfgz2765/NVIDIA-Linux-x86-1.0-6629-pkg1/usr/src
/nv] Error 2
NVIDIA: left KBUILD.
nvidia.ko failed to build!
make[1]: *** [module] Error 1
make: *** [module] Error 2
-> Error.
ERROR: Unable to build the NVIDIA kernel module.
ERROR: Installation has failed. Please see the file
'/var/log/nvidia-installer.log' for details. You may find suggestions
on fixing installation problems in the README available on the Linux
driver download page at www.nvidia.com.
Was tun?
J Gast |
